Reaction Details
TargetBeta-3 adrenergic receptor
LigandBDBM50156267
Substrate/Competitorn/a
Meas. Tech.ChEMBL_310533 (CHEMBL834428)
EC50 0.310000±n/a nM
Citation Sawa, MTateishi, HMizuno, KHarada, HOue, MTsujiuchi, HFurutani, YKato, S Tryptamine-based human beta3-adrenergic receptor agonists. Part 2: SAR of the methylene derivatives. Bioorg Med Chem Lett14:5963-6 (2004) 
 
Beta-3 adrenergic receptor
Name:Beta-3 adrenergic receptor
Type:G Protein-Coupled Receptor (GPCR)
Mol. Mass.:43534.88
Organism:Homo sapiens (Human)
Description:n/a
Residue:408
BDBM50156267
NameBDBM50156267
Synonyms:3-Amino-N-(3-{(R)-1-hydroxy-2-[2-(7-methanesulfonyl-1H-indol-3-yl)-ethylamino]-ethyl}-phenyl)-benzenesulfonamide | CHEMBL186247
TypeSmall organic molecule
Emp. Form.C25H28N4O5S2
Mol. Mass.528.644
SMILESCS(=O)(=O)c1cccc2c(CCNC[C@H](O)c3cccc(NS(=O)(=O)c4cccc(N)c4)c3)c[nH]c12