Reaction Details
TargetSphingosine 1-phosphate receptor 2
LigandBDBM50152329
Substrate/Competitorn/a
Meas. Tech.ChEMBL_430294 (CHEMBL913920)
IC50>10000±n/a nM
Citation Hale, JJLynch, CLNeway, WMills, SGHajdu, RKeohane, CARosenbach, MJMilligan, JAShei, GJParent, SAChrebet, GBergstrom, JCard, DFerrer, MHodder, PStrulovici, BRosen, HMandala, S A rational utilization of high-throughput screening affords selective, orally bioavailable 1-benzyl-3-carboxyazetidine sphingosine-1-phosphate-1 receptor agonists. J Med Chem47:6662-5 (2004) 
 
Sphingosine 1-phosphate receptor 2
Name:Sphingosine 1-phosphate receptor 2
Type:G Protein-Coupled Receptor (GPCR)
Mol. Mass.:38883.16
Organism:Homo sapiens (Human)
Description:Membranes isolated from S1P2-transfected CHO cells were used in ligand binding assay.
Residue:353
BDBM50152329
NameBDBM50152329
Synonyms:1-(4-nonylbenzyl)pyrrolidin-3-ylphosphonic acid [1-(4-Nonyl-benzyl)-pyrrolidin-3-yl]-phosphonic acid
TypeSmall organic molecule
Emp. Form.C20H34NO3P
Mol. Mass.367.4626
SMILESCCCCCCCCCc1ccc(CN2CCC(C2)P(O)(O)=O)cc1