Reaction Details
TargetSphingosine 1-phosphate receptor 3
LigandBDBM50158347
Substrate/Competitorn/a
Meas. Tech.ChEMBL_430295 (CHEMBL913921)
IC50 4300±n/a nM
Citation Hale, JJLynch, CLNeway, WMills, SGHajdu, RKeohane, CARosenbach, MJMilligan, JAShei, GJParent, SAChrebet, GBergstrom, JCard, DFerrer, MHodder, PStrulovici, BRosen, HMandala, S A rational utilization of high-throughput screening affords selective, orally bioavailable 1-benzyl-3-carboxyazetidine sphingosine-1-phosphate-1 receptor agonists. J Med Chem47:6662-5 (2004) 
 
Sphingosine 1-phosphate receptor 3
Name:Sphingosine 1-phosphate receptor 3
Type:G Protein-Coupled Receptor (GPCR)
Mol. Mass.:42278.13
Organism:Homo sapiens (Human)
Description:Q99500
Residue:378
BDBM50158347
NameBDBM50158347
Synonyms:1-(3-ethyl-4-((4-phenyl-5-(trifluoromethyl)thiophen-2-yl)methoxy)benzyl)azetidine-3-carboxylic acid | CHEMBL375488
TypeSmall organic molecule
Emp. Form.C25H24F3NO3S
Mol. Mass.475.523
SMILESCCc1cc(CN2CC(C2)C(O)=O)ccc1OCc1cc(c(s1)C(F)(F)F)-c1ccccc1