Reaction Details
TargetSphingosine 1-phosphate receptor 3
LigandBDBM50158352
Substrate/Competitorn/a
Meas. Tech.ChEMBL_430295 (CHEMBL913921)
IC50>10000±n/a nM
Citation Hale, JJLynch, CLNeway, WMills, SGHajdu, RKeohane, CARosenbach, MJMilligan, JAShei, GJParent, SAChrebet, GBergstrom, JCard, DFerrer, MHodder, PStrulovici, BRosen, HMandala, S A rational utilization of high-throughput screening affords selective, orally bioavailable 1-benzyl-3-carboxyazetidine sphingosine-1-phosphate-1 receptor agonists. J Med Chem47:6662-5 (2004) 
 
Sphingosine 1-phosphate receptor 3
Name:Sphingosine 1-phosphate receptor 3
Type:G Protein-Coupled Receptor (GPCR)
Mol. Mass.:42278.13
Organism:Homo sapiens (Human)
Description:Q99500
Residue:378
BDBM50158352
NameBDBM50158352
Synonyms:3-phenyl-5-(4-phenyl-5-(trifluoromethyl)thiophen-2-yl)-1,2,4-oxadiazole | CHEMBL389012
TypeSmall organic molecule
Emp. Form.C19H11F3N2OS
Mol. Mass.372.364
SMILESFC(F)(F)c1sc(cc1-c1ccccc1)-c1nc(no1)-c1ccccc1