Reaction Details
TargetSphingosine 1-phosphate receptor 2
LigandBDBM50158341
Substrate/Competitorn/a
Meas. Tech.ChEMBL_430294 (CHEMBL913920)
IC50>10000±n/a nM
Citation Hale, JJLynch, CLNeway, WMills, SGHajdu, RKeohane, CARosenbach, MJMilligan, JAShei, GJParent, SAChrebet, GBergstrom, JCard, DFerrer, MHodder, PStrulovici, BRosen, HMandala, S A rational utilization of high-throughput screening affords selective, orally bioavailable 1-benzyl-3-carboxyazetidine sphingosine-1-phosphate-1 receptor agonists. J Med Chem47:6662-5 (2004) 
 
Sphingosine 1-phosphate receptor 2
Name:Sphingosine 1-phosphate receptor 2
Type:G Protein-Coupled Receptor (GPCR)
Mol. Mass.:38883.16
Organism:Homo sapiens (Human)
Description:Membranes isolated from S1P2-transfected CHO cells were used in ligand binding assay.
Residue:353
BDBM50158341
NameBDBM50158341
Synonyms:1-(3-chloro-4-((4-phenyl-5-(trifluoromethyl)thiophen-2-yl)methoxy)benzyl)azetidine-3-carboxylic acid | CHEMBL224571
TypeSmall organic molecule
Emp. Form.C23H19ClF3NO3S
Mol. Mass.481.915
SMILESOC(=O)C1CN(Cc2ccc(OCc3cc(c(s3)C(F)(F)F)-c3ccccc3)c(Cl)c2)C1