Reaction Details
TargetSphingosine 1-phosphate receptor 4
LigandBDBM50158339
Substrate/Competitorn/a
Meas. Tech.ChEMBL_430296 (CHEMBL913922)
IC50 790±n/a nM
Citation Hale, JJLynch, CLNeway, WMills, SGHajdu, RKeohane, CARosenbach, MJMilligan, JAShei, GJParent, SAChrebet, GBergstrom, JCard, DFerrer, MHodder, PStrulovici, BRosen, HMandala, S A rational utilization of high-throughput screening affords selective, orally bioavailable 1-benzyl-3-carboxyazetidine sphingosine-1-phosphate-1 receptor agonists. J Med Chem47:6662-5 (2004) 
 
Sphingosine 1-phosphate receptor 4
Name:Sphingosine 1-phosphate receptor 4
Type:G Protein-Coupled Receptor (GPCR)
Mol. Mass.:41647.39
Organism:Homo sapiens (Human)
Description:n/a
Residue:384
BDBM50158339
NameBDBM50158339
Synonyms:1-(4-((4-phenyl-5-(trifluoromethyl)thiophen-2-yl)methoxy)benzyl)pyrrolidine-3-carboxylic acid | CHEMBL224799
TypeSmall organic molecule
Emp. Form.C24H22F3NO3S
Mol. Mass.461.497
SMILESOC(=O)C1CCN(Cc2ccc(OCc3cc(c(s3)C(F)(F)F)-c3ccccc3)cc2)C1