Reaction Details
TargetSphingosine 1-phosphate receptor 5
LigandBDBM50158334
Substrate/Competitorn/a
Meas. Tech.ChEMBL_430297 (CHEMBL913923)
IC50 13±n/a nM
Citation Hale, JJLynch, CLNeway, WMills, SGHajdu, RKeohane, CARosenbach, MJMilligan, JAShei, GJParent, SAChrebet, GBergstrom, JCard, DFerrer, MHodder, PStrulovici, BRosen, HMandala, S A rational utilization of high-throughput screening affords selective, orally bioavailable 1-benzyl-3-carboxyazetidine sphingosine-1-phosphate-1 receptor agonists. J Med Chem47:6662-5 (2004) 
 
Sphingosine 1-phosphate receptor 5
Name:Sphingosine 1-phosphate receptor 5
Type:G Protein-Coupled Receptor (GPCR)
Mol. Mass.:41796.42
Organism:Homo sapiens (Human)
Description:n/a
Residue:398
BDBM50158334
NameBDBM50158334
Synonyms:1-(3-methyl-4-((4-phenyl-5-(trifluoromethyl)thiophen-2-yl)methoxy)benzyl)azetidine-3-carboxylic acid | CHEMBL224005
TypeSmall organic molecule
Emp. Form.C24H22F3NO3S
Mol. Mass.461.497
SMILESCc1cc(CN2CC(C2)C(O)=O)ccc1OCc1cc(c(s1)C(F)(F)F)-c1ccccc1