Reaction Details
TargetSphingosine 1-phosphate receptor 3
LigandBDBM50158351
Substrate/Competitorn/a
Meas. Tech.ChEMBL_430295 (CHEMBL913921)
IC50>10000±n/a nM
Citation Hale, JJLynch, CLNeway, WMills, SGHajdu, RKeohane, CARosenbach, MJMilligan, JAShei, GJParent, SAChrebet, GBergstrom, JCard, DFerrer, MHodder, PStrulovici, BRosen, HMandala, S A rational utilization of high-throughput screening affords selective, orally bioavailable 1-benzyl-3-carboxyazetidine sphingosine-1-phosphate-1 receptor agonists. J Med Chem47:6662-5 (2004) 
 
Sphingosine 1-phosphate receptor 3
Name:Sphingosine 1-phosphate receptor 3
Type:G Protein-Coupled Receptor (GPCR)
Mol. Mass.:42278.13
Organism:Homo sapiens (Human)
Description:Q99500
Residue:378
BDBM50158351
NameBDBM50158351
Synonyms:26-tert-butyl-13-(2,4,4-trimethylpentan-2-yl)-3,6,9,16,19,22-hexaoxatricyclo[22.3.1.0^{10,15}]octacosa-1(28),10(15),11,13,24,26-hexaene-28-carboxylic acid | CHEMBL224549
TypeSmall organic molecule
Emp. Form.C24H19F6NO3S
Mol. Mass.515.468
SMILESOC(=O)C1CN(Cc2ccc(OCc3cc(c(s3)C(F)(F)F)-c3ccccc3)c(c2)C(F)(F)F)C1