Reaction Details
TargetSphingosine 1-phosphate receptor 3
LigandBDBM50158349
Substrate/Competitorn/a
Meas. Tech.ChEMBL_430295 (CHEMBL913921)
IC50 1000±n/a nM
Citation Hale, JJLynch, CLNeway, WMills, SGHajdu, RKeohane, CARosenbach, MJMilligan, JAShei, GJParent, SAChrebet, GBergstrom, JCard, DFerrer, MHodder, PStrulovici, BRosen, HMandala, S A rational utilization of high-throughput screening affords selective, orally bioavailable 1-benzyl-3-carboxyazetidine sphingosine-1-phosphate-1 receptor agonists. J Med Chem47:6662-5 (2004) 
 
Sphingosine 1-phosphate receptor 3
Name:Sphingosine 1-phosphate receptor 3
Type:G Protein-Coupled Receptor (GPCR)
Mol. Mass.:42278.13
Organism:Homo sapiens (Human)
Description:Q99500
Residue:378
BDBM50158349
NameBDBM50158349
Synonyms:1-(4-(5-(4-phenyl-5-(trifluoromethyl)thiophen-2-yl)-1,2,4-oxadiazol-3-yl)benzyl)azetidine-3-carboxylic acid | CHEMBL225575
TypeSmall organic molecule
Emp. Form.C24H18F3N3O3S
Mol. Mass.485.478
SMILESOC(=O)C1CN(Cc2ccc(cc2)-c2noc(n2)-c2cc(c(s2)C(F)(F)F)-c2ccccc2)C1