Reaction Details
TargetSphingosine 1-phosphate receptor 2
LigandBDBM50158337
Substrate/Competitorn/a
Meas. Tech.ChEMBL_430294 (CHEMBL913920)
IC50>10000±n/a nM
Citation Hale, JJLynch, CLNeway, WMills, SGHajdu, RKeohane, CARosenbach, MJMilligan, JAShei, GJParent, SAChrebet, GBergstrom, JCard, DFerrer, MHodder, PStrulovici, BRosen, HMandala, S A rational utilization of high-throughput screening affords selective, orally bioavailable 1-benzyl-3-carboxyazetidine sphingosine-1-phosphate-1 receptor agonists. J Med Chem47:6662-5 (2004) 
 
Sphingosine 1-phosphate receptor 2
Name:Sphingosine 1-phosphate receptor 2
Type:G Protein-Coupled Receptor (GPCR)
Mol. Mass.:38883.16
Organism:Homo sapiens (Human)
Description:Membranes isolated from S1P2-transfected CHO cells were used in ligand binding assay.
Residue:353
BDBM50158337
NameBDBM50158337
Synonyms:3-(2,4-dichlorophenyl)-5-(4-phenyl-5-(trifluoromethyl)thiophen-2-yl)-1,2,4-oxadiazole | CHEMBL374614
TypeSmall organic molecule
Emp. Form.C19H9Cl2F3N2OS
Mol. Mass.441.254
SMILESFC(F)(F)c1sc(cc1-c1ccccc1)-c1nc(no1)-c1ccc(Cl)cc1Cl