Reaction Details
TargetBeta-2 adrenergic receptor
LigandBDBM50160818
Substrate/Competitorn/a
Meas. Tech.ChEMBL_304200 (CHEMBL829740)
EC50 19±n/a nM
Citation Sawa, MMizuno, KHarada, HTateishi, HArai, YSuzuki, SOue, MTsujiuchi, HFurutani, YKato, S Tryptamine-based human beta3-adrenergic receptor agonists. Part 3: improved oral bioavailability via modification of the sulfonamide moiety. Bioorg Med Chem Lett15:1061-4 (2005) 
 
Beta-2 adrenergic receptor
Name:Beta-2 adrenergic receptor
Type:n/a
Mol. Mass.:46461.69
Organism:Homo sapiens (Human)
Description:P07550
Residue:413
BDBM50160818
NameBDBM50160818
Synonyms:CHEMBL181440 | Methanesulfonic acid (R)-3-{2-[(R)-2-(3-benzenesulfonylamino-phenyl)-2-hydroxy-ethylamino]-propyl}-1H-indol-7-yl ester
TypeSmall organic molecule
Emp. Form.C26H29N3O6S2
Mol. Mass.543.655
SMILESC[C@H](Cc1c[nH]c2c(OS(C)(=O)=O)cccc12)NC[C@H](O)c1cccc(NS(=O)(=O)c2ccccc2)c1