Reaction Details
TargetEpidermal growth factor receptor
LigandBDBM13910
Substrate/Competitorn/a
Meas. Tech.ChEMBL_321412 (CHEMBL881943)
IC50>25000±n/a nM
Citation Fink, BEVite, GDMastalerz, HKadow, JFKim, SHLeavitt, KJDu, KCrews, DMitt, TWong, TWHunt, JTVyas, DMTokarski, JS New dual inhibitors of EGFR and HER2 protein tyrosine kinases. Bioorg Med Chem Lett15:4774-9 (2005) 
 
Epidermal growth factor receptor
Name:Epidermal growth factor receptor
Type:Receptor Kinase Domain
Mol. Mass.:134279.59
Organism:Homo sapiens (Human)
Description:P00533
Residue:1210
BDBM13910
NameBDBM13910
Synonyms:CHEMBL197568 pyrrolo[2,1-f][1,2,4]triazine analog 5k
TypeSmall organic molecule
Emp. Form.C30H26N6O2
Mol. Mass.502.5664
SMILESCCOC(=O)c1cn2ncnc(Nc3ccc4n(Cc5ccccc5)ncc4c3)c2c1Cc1ccccc1