Reaction Details
TargetEpidermal growth factor receptor
LigandBDBM13917
Substrate/Competitorn/a
Meas. Tech.ChEMBL_321412 (CHEMBL881943)
IC50 7400±n/a nM
Citation Fink, BEVite, GDMastalerz, HKadow, JFKim, SHLeavitt, KJDu, KCrews, DMitt, TWong, TWHunt, JTVyas, DMTokarski, JS New dual inhibitors of EGFR and HER2 protein tyrosine kinases. Bioorg Med Chem Lett15:4774-9 (2005) 
 
Epidermal growth factor receptor
Name:Epidermal growth factor receptor
Type:Receptor Kinase Domain
Mol. Mass.:134279.59
Organism:Homo sapiens (Human)
Description:P00533
Residue:1210
BDBM13917
NameBDBM13917
Synonyms:1-benzyl-N-{5-ethyl-6-[(ethylamino)methyl]pyrrolo[1,2-a][1,2,4]triazin-4-yl}-1H-indazol-5-amine pyrrolo[2,1-f][1,2,4]triazine analog 11
TypeSmall organic molecule
Emp. Form.C25H27N7
Mol. Mass.425.5288
SMILESCCNCc1cn2ncnc(Nc3ccc4n(Cc5ccccc5)ncc4c3)c2c1CC