Reaction Details
TargetReceptor tyrosine-protein kinase erbB-2
LigandBDBM13906
Substrate/Competitorn/a
Meas. Tech.ChEMBL_321451 (CHEMBL880259)
IC50 390±n/a nM
Citation Fink, BEVite, GDMastalerz, HKadow, JFKim, SHLeavitt, KJDu, KCrews, DMitt, TWong, TWHunt, JTVyas, DMTokarski, JS New dual inhibitors of EGFR and HER2 protein tyrosine kinases. Bioorg Med Chem Lett15:4774-9 (2005) 
 
Receptor tyrosine-protein kinase erbB-2
Name:Receptor tyrosine-protein kinase erbB-2
Type:n/a
Mol. Mass.:137894.47
Organism:Homo sapiens (Human)
Description:P04626
Residue:1255
BDBM13906
NameBDBM13906
Synonyms:CHEMBL425738 pyrrolo[2,1-f][1,2,4]triazine analog 5g
TypeSmall organic molecule
Emp. Form.C23H20N6O2
Mol. Mass.412.4439
SMILESCCOC(=O)c1cc2c(Nc3ccc4n(Cc5ccccc5)ncc4c3)ncnn2c1