Reaction Details
TargetSerine/threonine-protein kinase mTOR
LigandBDBM50174275
Substrate/Competitorn/a
Meas. Tech.ChEMBL_326904 (CHEMBL871328)
IC50 4.8±n/a nM
Citation Wagner, RMollison, KWLiu, LHenry, CLRosenberg, TABamaung, NTu, NWiedeman, PEOr, YLuly, JRLane, BCTrevillyan, JChen, YWFey, THsieh, GMarsh, KNuss, MJacobson, PBWilcox, DCarlson, RPCarter, GWDjuric, SW Rapamycin analogs with reduced systemic exposure. Bioorg Med Chem Lett15:5340-3 (2005) 
 
Serine/threonine-protein kinase mTOR
Name:Serine/threonine-protein kinase mTOR
Type:Rapamycin target protein
Mol. Mass.:288917.12
Organism:Homo sapiens (Human)
Description:P42345
Residue:2549
BDBM50174275
NameBDBM50174275
Synonyms:(1R,9S,12S,15R,16E,18R,19R,21R,23S,24E,26E,28E,30S,32S,35R)-1,18-dihydroxy-19,30-dimethoxy-12-[(2R)-1-[(1S,3R,4S)-3-methoxy-4-(2H-1,2,3,4-tetrazol-2-yl)cyclohexyl]propan-2-yl]-15,17,21,23,29,35-hexamethyl-11,36-dioxa-4-azatricyclo[30.3.1.0^{4,9}]hexatriaconta-16,24,26,28-tetraene-2,3,10,14,20-pentone | CHEMBL439319
TypeSmall organic molecule
Emp. Form.C52H79N5O12
Mol. Mass.966.21
SMILESCO[C@@H]1C[C@H](C[C@@H](C)[C@@H]2CC(=O)[C@H](C)\C=C(C)\[C@@H](O)[C@@H](OC)C(=O)[C@H](C)C[C@H](C)\C=C\C=C\C=C(C)\[C@H](C[C@@H]3CC[C@@H](C)[C@@](O)(O3)C(=O)C(=O)N3CCCC[C@H]3C(=O)O2)OC)CC[C@@H]1n1ncnn1