Reaction Details
TargetVascular endothelial growth factor receptor 2
LigandBDBM50178494
Substrate/Competitorn/a
Meas. Tech.ChEMBL_331142 (CHEMBL862243)
IC50 12600±n/a nM
Citation Lee, KIPark, YPark, SJHwang, JHLee, SJKim, GDPark, WKLee, SJeong, DKong, JYKang, HKCho, H Naphthofuroquinone derivatives: inhibition of receptor tyrosine kinases. Bioorg Med Chem Lett16:737-42 (2005) 
 
Vascular endothelial growth factor receptor 2
Name:Vascular endothelial growth factor receptor 2
Type:Receptor Tyrosine Kinase
Mol. Mass.:151510.97
Organism:Homo sapiens (Human)
Description:P35968
Residue:1356
BDBM50178494
NameBDBM50178494
Synonyms:5-(2-diethylamino-ethoxy)-7,12-dioxo-7,12-dihydro-dinaphtho[1,2-b;2',3'-d]furan-6-carboxylic acid methyl ester | CHEMBL202162
TypeSmall organic molecule
Emp. Form.C28H25NO6
Mol. Mass.471.5012
SMILESCCN(CC)CCOc1c(C(=O)OC)c2c3c(oc2c2ccccc12)C(=O)c1ccccc1C3=O