Reaction Details
TargetProteinase-activated receptor 4
LigandBDBM176053
Substrate/Competitorn/a
Meas. Tech.ChEMBL_2234808 (CHEMBL5148580)
IC50 0.300000±n/a nM
Citation Priestley, ESBanville, JDeon, DDubé, LGagnon, MGuy, JLapointe, PLavallée, JFMartel, APlamondon, SRémillard, RRuediger, ETremblay, FPosy, SLGuarino, VRRichter, JMLi, JGupta, AVetrichelvan, MBalapragalathan, TJMathur, AHua, JCallejo, MGuay, JSum, CSCvijic, MEWatson, CWong, PYang, JBouvier, MGordon, DAWexler, RRMarinier, A Discovery of Two Novel Antiplatelet Clinical Candidates (BMS-986120 and BMS-986141) That Antagonize Protease-Activated Receptor 4. J Med Chem65:8843-8854 (2022) 
 
Proteinase-activated receptor 4
Name:Proteinase-activated receptor 4
Type:Protein
Mol. Mass.:41145.16
Organism:Homo sapiens (Human)
Description:Q96RI0
Residue:385
BDBM176053
NameBDBM176053
Synonyms:US10047103, 86 | US9688695, 86
TypeSmall organic molecule
Emp. Form.C23H20F3N5O5S2
Mol. Mass.567.561
SMILESCOc1nn2cc(nc2s1)-c1cc2c(OCc3nc(sc3C(F)(F)F)N3CCOCC3)cc(OC)cc2o1