Reaction Details
TargetMitogen-activated protein kinase kinase kinase 20
LigandBDBM50184484
Substrate/Competitorn/a
Meas. Tech.ChEMBL_337604 (CHEMBL861565)
IC50>20000±n/a nM
Citation Li, HYWang, YHeap, CRKing, CHMundla, SRVoss, MClawson, DKYan, LCampbell, RMAnderson, BDWagner, JRBritt, KLu, KXMcMillen, WTYingling, JM Dihydropyrrolopyrazole transforming growth factor-beta type I receptor kinase domain inhibitors: a novel benzimidazole series with selectivity versus transforming growth factor-beta type II receptor kinase and mixed lineage kinase-7. J Med Chem49:2138-42 (2006) 
 
Mitogen-activated protein kinase kinase kinase 20
Name:Mitogen-activated protein kinase kinase kinase 20
Type:PROTEIN
Mol. Mass.:91168.58
Organism:Homo sapiens (Human)
Description:ChEMBL_1495629
Residue:800
BDBM50184484
NameBDBM50184484
Synonyms:5-(2-pyridin-2-yl-5,6-dihydro-4H-pyrrolo[1,2-b]pyrazol-3-yl)-1-[3-(tetrahydro-pyran-2-yloxy)-propyl]-1H-benzoimidazole | CHEMBL204158
TypeSmall organic molecule
Emp. Form.C26H29N5O2
Mol. Mass.443.5408
SMILESC(COC1CCCCO1)Cn1cnc2cc(ccc12)-c1c2CCCn2nc1-c1ccccn1