Reaction Details
TargetMitogen-activated protein kinase kinase kinase 20
LigandBDBM50184481
Substrate/Competitorn/a
Meas. Tech.ChEMBL_337604 (CHEMBL861565)
IC50 16610±n/a nM
Citation Li, HYWang, YHeap, CRKing, CHMundla, SRVoss, MClawson, DKYan, LCampbell, RMAnderson, BDWagner, JRBritt, KLu, KXMcMillen, WTYingling, JM Dihydropyrrolopyrazole transforming growth factor-beta type I receptor kinase domain inhibitors: a novel benzimidazole series with selectivity versus transforming growth factor-beta type II receptor kinase and mixed lineage kinase-7. J Med Chem49:2138-42 (2006) 
 
Mitogen-activated protein kinase kinase kinase 20
Name:Mitogen-activated protein kinase kinase kinase 20
Type:PROTEIN
Mol. Mass.:91168.58
Organism:Homo sapiens (Human)
Description:ChEMBL_1495629
Residue:800
BDBM50184481
NameBDBM50184481
Synonyms:1-methyl-5-(2-pyridin-2-yl-5,6-dihydro-4H-pyrrolo[1,2-b]pyrazol-3-yl)-1H-indole | CHEMBL427211
TypeSmall organic molecule
Emp. Form.C20H18N4
Mol. Mass.314.3837
SMILESCn1ccc2cc(ccc12)-c1c2CCCn2nc1-c1ccccn1