Reaction Details
TargetC-X-C chemokine receptor type 2
LigandBDBM50184524
Substrate/Competitorn/a
Meas. Tech.ChEMBL_355078 (CHEMBL870125)
Ki 60±n/a nM
Citation Ho, KKAuld, DSBohnstedt, ACConti, PDokter, WErickson, SFeng, DInglese, JKingsbury, CKultgen, SGLiu, RQMasterson, CMOhlmeyer, MRong, YRooseboom, MRoughton, ASamama, PSmit, MJSon, Evan der Louw, JVogel, GWebb, MWijkmans, JYou, M Imidazolylpyrimidine based CXCR2 chemokine receptor antagonists. Bioorg Med Chem Lett16:2724-8 (2006) 
 
C-X-C chemokine receptor type 2
Name:C-X-C chemokine receptor type 2
Type:Protein
Mol. Mass.:40767.88
Organism:Homo sapiens (Human)
Description:P25025
Residue:360
BDBM50184524
NameBDBM50184524
Synonyms:(2S)-2-(2-(1H-imidazol-1-yl)-6-(octylthio)pyrimidin-4-ylamino)-N-(3-ethoxypropyl)-4-methylpentanamide | CHEMBL207725
TypeSmall organic molecule
Emp. Form.C26H44N6O2S
Mol. Mass.504.732
SMILESCCCCCCCCSc1cc(N[C@@H](CC(C)C)C(=O)NCCCOCC)nc(n1)-n1ccnc1