Reaction Details
TargetCoagulation factor VII/Tissue factor
LigandBDBM50189939
Substrate/Competitorn/a
Meas. Tech.ChEMBL_393411 (CHEMBL913194)
Ki 1.3±n/a nM
Citation Hu, HKolesnikov, ARiggs, JRWesson, KEStephens, RLeahy, EMShrader, WDSprengeler, PAGreen, MJSanford, ENguyen, MGjerstad, ECabuslay, RYoung, WB Potent 4-amino-5-azaindole factor VIIa inhibitors. Bioorg Med Chem Lett16:4567-70 (2006) 
 
Coagulation factor VII/Tissue factor
Name:Coagulation factor VII/Tissue factor
Type:n/a
Mol. Mass.:n/a
Description:ASSAY_ID of EBI is 69535
Components:This complex has 2 components.
Component 1
Name:Tissue factor
Synonyms:CD_antigen=CD142 Coagulation factor VII/tissue factor TF Thromboplastin | Tissue factor
Type:PROTEIN
Mol. Mass.:33067.61
Organism:Homo sapiens (Human)
Description:ChEMBL_936735
Residue:295
Component 2
Name:Coagulation factor VII
Synonyms:Eptacog alfa FA7_HUMAN Factor VIIa (fVIIa) SPCA serum prothrombin conversion accelerator
Type:Enzyme
Mol. Mass.:51599.89
Organism:Homo sapiens (Human)
Description:n/a
Residue:466
BDBM50189939
NameBDBM50189939
Synonyms:5-(4-amino-1H-pyrrolo[3,2-c]pyridin-2-yl)-6-hydroxy-3'-[((S)-2-hydroxy-3-phenyl-propionylamino)-methyl]-biphenyl-3-carboxylic acid | CHEMBL386638
TypeSmall organic molecule
Emp. Form.C30H26N4O5
Mol. Mass.522.5512
SMILESNc1nccc2[nH]c(cc12)-c1cc(cc(-c2cccc(CNC(=O)[C@@H](O)Cc3ccccc3)c2)c1O)C(O)=O