Reaction Details
TargetNeprilysin
LigandBDBM50190758
Substrate/Competitorn/a
Meas. Tech.ChEMBL_369150 (CHEMBL862877)
IC50 124±n/a nM
Citation Pryde, DCMaw, GNPlanken, SPlatts, MYSanderson, VCorless, MStobie, ABarber, CGRussell, RFoster, LBarker, LWayman, CVan Der Graaf, PStacey, PMorren, DKohl, CBeaumont, KCoggon, STute, M Novel selective inhibitors of neutral endopeptidase for the treatment of female sexual arousal disorder. Synthesis and activity of functionalized glutaramides. J Med Chem49:4409-24 (2006) 
 
Neprilysin
Name:Neprilysin
Type:Enzyme
Mol. Mass.:85505.38
Organism:Homo sapiens (Human)
Description:P08473
Residue:750
BDBM50190758
NameBDBM50190758
Synonyms:2-((1-((5-isobutyl-1,3,4-thiadiazol-2-yl)carbamoyl)cyclopentyl)methyl)pentanoic acid | CHEMBL213964
TypeSmall organic molecule
Emp. Form.C18H29N3O3S
Mol. Mass.367.506
SMILESCCCC(CC1(CCCC1)C(=O)Nc1nnc(CC(C)C)s1)C(O)=O