Reaction Details
TargetNeprilysin
LigandBDBM50190764
Substrate/Competitorn/a
Meas. Tech.ChEMBL_369150 (CHEMBL862877)
IC50 84±n/a nM
Citation Pryde, DCMaw, GNPlanken, SPlatts, MYSanderson, VCorless, MStobie, ABarber, CGRussell, RFoster, LBarker, LWayman, CVan Der Graaf, PStacey, PMorren, DKohl, CBeaumont, KCoggon, STute, M Novel selective inhibitors of neutral endopeptidase for the treatment of female sexual arousal disorder. Synthesis and activity of functionalized glutaramides. J Med Chem49:4409-24 (2006) 
 
Neprilysin
Name:Neprilysin
Type:Enzyme
Mol. Mass.:85505.38
Organism:Homo sapiens (Human)
Description:P08473
Residue:750
BDBM50190764
NameBDBM50190764
Synonyms:2-((1-((5-ethyl-1,3,4-thiadiazol-2-yl)carbamoyl)cyclopentyl)methyl)hexanoic acid | CHEMBL212220
TypeSmall organic molecule
Emp. Form.C17H27N3O3S
Mol. Mass.353.48
SMILESCCCCC(CC1(CCCC1)C(=O)Nc1nnc(CC)s1)C(O)=O