Reaction Details
TargetNeprilysin
LigandBDBM50190763
Substrate/Competitorn/a
Meas. Tech.ChEMBL_369150 (CHEMBL862877)
IC50 237±n/a nM
Citation Pryde, DCMaw, GNPlanken, SPlatts, MYSanderson, VCorless, MStobie, ABarber, CGRussell, RFoster, LBarker, LWayman, CVan Der Graaf, PStacey, PMorren, DKohl, CBeaumont, KCoggon, STute, M Novel selective inhibitors of neutral endopeptidase for the treatment of female sexual arousal disorder. Synthesis and activity of functionalized glutaramides. J Med Chem49:4409-24 (2006) 
 
Neprilysin
Name:Neprilysin
Type:Enzyme
Mol. Mass.:85505.38
Organism:Homo sapiens (Human)
Description:P08473
Residue:750
BDBM50190763
NameBDBM50190763
Synonyms:3-(1-((5-ethyl-1,3,4-thiadiazol-2-yl)carbamoyl)cyclopentyl)propanoic acid | CHEMBL212001
TypeSmall organic molecule
Emp. Form.C13H19N3O3S
Mol. Mass.297.373
SMILESCCc1nnc(NC(=O)C2(CCC(O)=O)CCCC2)s1