Reaction Details
TargetSodium-dependent serotonin transporter
LigandBDBM50198585
Substrate/Competitorn/a
Meas. Tech.ChEMBL_440970 (CHEMBL890060)
Ki 1.8±n/a nM
Citation Keith, JMGomez, LALetavic, MALy, KSJablonowski, JASeierstad, MBarbier, AJWilson, SJBoggs, JDFraser, ICMazur, CLovenberg, TWCarruthers, NI Dual serotonin transporter/histamine H3 ligands: Optimization of the H3 pharmacophore. Bioorg Med Chem Lett17:702-6 (2007) 
 
Sodium-dependent serotonin transporter
Name:Sodium-dependent serotonin transporter
Type:Multi-pass membrane protein
Mol. Mass.:70322.51
Organism:Homo sapiens (Human)
Description:P31645
Residue:630
BDBM50198585
NameBDBM50198585
Synonyms:7-(3-(4-isopropylpiperazin-1-yl)propoxy)-4-(4-methoxyphenyl)-2-methyl-1,2,3,4-tetrahydroisoquinoline | CHEMBL394787
TypeSmall organic molecule
Emp. Form.C27H39N3O2
Mol. Mass.437.6175
SMILESCOc1ccc(cc1)C1CN(C)Cc2cc(OCCCN3CCN(CC3)C(C)C)ccc12