Reaction Details
TargetcAMP-dependent protein kinase catalytic subunit alpha
LigandBDBM50199310
Substrate/Competitorn/a
Meas. Tech.ChEMBL_420145 (CHEMBL912715)
IC50 5.3±n/a nM
Citation Enkvist, ELavogina, DRaidaru, GVaasa, AViil, ILust, MViht, KUri, A Conjugation of adenosine and hexa-(D-arginine) leads to a nanomolar bisubstrate-analog inhibitor of basophilic protein kinases. J Med Chem49:7150-9 (2006) 
 
cAMP-dependent protein kinase catalytic subunit alpha
Name:cAMP-dependent protein kinase catalytic subunit alpha
Type:Enzyme Catalytic Subunit
Mol. Mass.:40598.73
Organism:Homo sapiens (Human)
Description:n/a
Residue:351
BDBM50199310
NameBDBM50199310
Synonyms:2S,3S,4R,5R)-5-6-amino-9H-purin-9-yl)-N-12R,15R,18R,21R,24R,27R)-12,15,18,21,24,27-hexakis3-guanidinopropyl)-1-isoquinoline-5-sulfonamido)-9,11,14,17,20,23,26,29-octaoxo-3,10,13,16,19,22,25,28-o ctaazatetratriacontan-34-yl)-3,4-dihydroxytetrahydrofuran-2-carboxamide | CHEMBL413460
TypeSmall organic molecule
Emp. Form.C69H116N34O14S
Mol. Mass.1677.944
SMILESNC(=N)NCCC[C@@H](NC(=O)CCCCCNC(=O)[C@H]1O[C@H]([C@H](O)[C@@H]1O)n1cnc2c(N)ncnc12)C(=O)N[C@H](CCCNC(N)=N)C(=O)N[C@H](CCCNC(N)=N)C(=O)N[C@H](CCCNC(N)=N)C(=O)N[C@H](CCCNC(N)=N)C(=O)N[C@H](CCCNC(N)=N)C(=O)NC(=O)CCCCCNCCNS(=O)(=O)c1cccc2cnccc12