Reaction Details
TargetHistamine H3 receptor
LigandBDBM50199601
Substrate/Competitorn/a
Meas. Tech.ChEMBL_453434 (CHEMBL885433)
Ki 2±n/a nM
Citation Letavic, MAKeith, JMJablonowski, JAStocking, EMGomez, LALy, KSMiller, JMBarbier, AJBonaventure, PBoggs, JDWilson, SJMiller, KLLord, BMcAllister, HMTognarelli, DJWu, JAbad, MCSchubert, CLovenberg, TWCarruthers, NI Novel tetrahydroisoquinolines are histamine H3 antagonists and serotonin reuptake inhibitors. Bioorg Med Chem Lett17:1047-51 (2007) 
 
Histamine H3 receptor
Name:Histamine H3 receptor
Type:G Protein-Coupled Receptor (GPCR)
Mol. Mass.:48691.47
Organism:Homo sapiens (Human)
Description:Binding assays were using CHO cells stably expressing hH3R receptors.
Residue:445
BDBM50199601
NameBDBM50199601
Synonyms:7-(3-(4-fluoropiperidin-1-yl)propoxy)-4-(3-methoxyphenyl)-2-methyl-1,2,3,4-tetrahydroisoquinoline | CHEMBL397299
TypeSmall organic molecule
Emp. Form.C25H33FN2O2
Mol. Mass.412.5401
SMILESCOc1cccc(c1)C1CN(C)Cc2cc(OCCCN3CCC(F)CC3)ccc12