Reaction Details
TargetSodium-dependent serotonin transporter
LigandBDBM50198593
Substrate/Competitorn/a
Meas. Tech.ChEMBL_453433 (CHEMBL885432)
Ki 2.70±n/a nM
Citation Letavic, MAKeith, JMJablonowski, JAStocking, EMGomez, LALy, KSMiller, JMBarbier, AJBonaventure, PBoggs, JDWilson, SJMiller, KLLord, BMcAllister, HMTognarelli, DJWu, JAbad, MCSchubert, CLovenberg, TWCarruthers, NI Novel tetrahydroisoquinolines are histamine H3 antagonists and serotonin reuptake inhibitors. Bioorg Med Chem Lett17:1047-51 (2007) 
 
Sodium-dependent serotonin transporter
Name:Sodium-dependent serotonin transporter
Type:Multi-pass membrane protein
Mol. Mass.:70322.51
Organism:Homo sapiens (Human)
Description:P31645
Residue:630
BDBM50198593
NameBDBM50198593
Synonyms:7-(3-(4-fluoropiperidin-1-yl)propoxy)-4-(4-methoxyphenyl)-2-methyl-1,2,3,4-tetrahydroisoquinoline | CHEMBL233054
TypeSmall organic molecule
Emp. Form.C25H33FN2O2
Mol. Mass.412.5401
SMILESCOc1ccc(cc1)C1CN(C)Cc2cc(OCCCN3CCC(F)CC3)ccc12