Reaction Details
TargetHistamine H3 receptor
LigandBDBM50198590
Substrate/Competitorn/a
Meas. Tech.ChEMBL_453434 (CHEMBL885433)
Ki 2±n/a nM
Citation Letavic, MAKeith, JMJablonowski, JAStocking, EMGomez, LALy, KSMiller, JMBarbier, AJBonaventure, PBoggs, JDWilson, SJMiller, KLLord, BMcAllister, HMTognarelli, DJWu, JAbad, MCSchubert, CLovenberg, TWCarruthers, NI Novel tetrahydroisoquinolines are histamine H3 antagonists and serotonin reuptake inhibitors. Bioorg Med Chem Lett17:1047-51 (2007) 
 
Histamine H3 receptor
Name:Histamine H3 receptor
Type:G Protein-Coupled Receptor (GPCR)
Mol. Mass.:48691.47
Organism:Homo sapiens (Human)
Description:Binding assays were using CHO cells stably expressing hH3R receptors.
Residue:445
BDBM50198590
NameBDBM50198590
Synonyms:4-(4-methoxyphenyl)-2-methyl-7-(3-(piperidin-1-yl)propoxy)-1,2,3,4-tetrahydroisoquinoline | CHEMBL394861
TypeSmall organic molecule
Emp. Form.C25H34N2O2
Mol. Mass.394.5497
SMILESCOc1ccc(cc1)C1CN(C)Cc2cc(OCCCN3CCCCC3)ccc12