Reaction Details
TargetPeroxisome proliferator-activated receptor delta
LigandBDBM50200418
Substrate/Competitorn/a
Meas. Tech.ChEMBL_453679 (CHEMBL885680)
EC50 11±n/a nM
Citation Cantin, LDLiang, SOgutu, HIwuagwu, CIBoakye, KBullock, WHBurns, MClark, RClaus, TdelaCruz, FEDaly, MEhrgott, FJJohnson, JSKeiper, CLivingston, JNSchoenleber, RWShapiro, JTown, CYang, LTsutsumi, MMa, X Indanylacetic acid derivatives carrying aryl-pyridyl and aryl-pyrimidinyl tail groups--new classes of PPAR gamma/delta and PPAR alpha/gamma/delta agonists. Bioorg Med Chem Lett17:1056-61 (2007) 
 
Peroxisome proliferator-activated receptor delta
Name:Peroxisome proliferator-activated receptor delta
Type:Enzyme
Mol. Mass.:49910.45
Organism:Homo sapiens (Human)
Description:Q03181
Residue:441
BDBM50200418
NameBDBM50200418
Synonyms:(S)-2-(5-(3-((2-(4-ethylphenyl)-6-methylpyrimidin-4-yl)(methyl)amino)propoxy)-2,3-dihydro-1H-inden-1-yl)acetic acid | CHEMBL240459
TypeSmall organic molecule
Emp. Form.C28H33N3O3
Mol. Mass.459.5799
SMILESCCc1ccc(cc1)-c1nc(C)cc(n1)N(C)CCCOc1ccc2[C@H](CC(O)=O)CCc2c1