Reaction Details
TargetPeroxisome proliferator-activated receptor delta
LigandBDBM50200413
Substrate/Competitorn/a
Meas. Tech.ChEMBL_453679 (CHEMBL885680)
EC50 23±n/a nM
Citation Cantin, LDLiang, SOgutu, HIwuagwu, CIBoakye, KBullock, WHBurns, MClark, RClaus, TdelaCruz, FEDaly, MEhrgott, FJJohnson, JSKeiper, CLivingston, JNSchoenleber, RWShapiro, JTown, CYang, LTsutsumi, MMa, X Indanylacetic acid derivatives carrying aryl-pyridyl and aryl-pyrimidinyl tail groups--new classes of PPAR gamma/delta and PPAR alpha/gamma/delta agonists. Bioorg Med Chem Lett17:1056-61 (2007) 
 
Peroxisome proliferator-activated receptor delta
Name:Peroxisome proliferator-activated receptor delta
Type:Enzyme
Mol. Mass.:49910.45
Organism:Homo sapiens (Human)
Description:Q03181
Residue:441
BDBM50200413
NameBDBM50200413
Synonyms:2-((S)-5-(3-((2-(3-chlorophenyl)-5-methylpyrimidin-4-yl)(methyl)amino)propoxy)-2,3-dihydro-1H-inden-1-yl)acetic acid | CHEMBL238946
TypeSmall organic molecule
Emp. Form.C26H28ClN3O3
Mol. Mass.465.972
SMILESCN(CCCOc1ccc2[C@H](CC(O)=O)CCc2c1)c1nc(ncc1C)-c1cccc(Cl)c1