Reaction Details
Target5-hydroxytryptamine receptor 2C
LigandBDBM50205872
Substrate/Competitorn/a
Meas. Tech.ChEMBL_428466 (CHEMBL918967)
Ki 176±n/a nM
Citation Wacker, DAVarnes, JGMalmstrom, SECao, XHung, CPUng, TWu, GZhang, GZuvich, EThomas, MAKeim, WJCullen, MJRohrbach, KWQu, QNarayanan, RRossi, KJanovitz, ELehman-McKeeman, LMalley, MFDevenny, JPelleymounter, MAMiller, KJRobl, JA Discovery of (R)-9-ethyl-1,3,4,10b-tetrahydro-7-trifluoromethylpyrazino[2,1-a]isoindol- 6(2H)-one, a selective, orally active agonist of the 5-HT(2C) receptor. J Med Chem50:1365-79 (2007) 
 
5-hydroxytryptamine receptor 2C
Name:5-hydroxytryptamine receptor 2C
Type:G Protein-Coupled Receptor (GPCR)
Mol. Mass.:51836.79
Organism:Homo sapiens (Human)
Description:P28335
Residue:458
BDBM50205872
NameBDBM50205872
Synonyms:(R)-8-chloro-7-methoxy-1,3,4,10b-tetrahydropyrazino[2,1-a]-isoindol-6(2H)-one | CHEMBL385577
TypeSmall organic molecule
Emp. Form.C12H13ClN2O2
Mol. Mass.252.697
SMILESCOc1c2C(=O)N3CCNC[C@H]3c2ccc1Cl