Reaction Details
Target5-hydroxytryptamine receptor 2C
LigandBDBM50205858
Substrate/Competitorn/a
Meas. Tech.ChEMBL_428466 (CHEMBL918967)
Ki 36±n/a nM
Citation Wacker, DAVarnes, JGMalmstrom, SECao, XHung, CPUng, TWu, GZhang, GZuvich, EThomas, MAKeim, WJCullen, MJRohrbach, KWQu, QNarayanan, RRossi, KJanovitz, ELehman-McKeeman, LMalley, MFDevenny, JPelleymounter, MAMiller, KJRobl, JA Discovery of (R)-9-ethyl-1,3,4,10b-tetrahydro-7-trifluoromethylpyrazino[2,1-a]isoindol- 6(2H)-one, a selective, orally active agonist of the 5-HT(2C) receptor. J Med Chem50:1365-79 (2007) 
 
5-hydroxytryptamine receptor 2C
Name:5-hydroxytryptamine receptor 2C
Type:G Protein-Coupled Receptor (GPCR)
Mol. Mass.:51836.79
Organism:Homo sapiens (Human)
Description:P28335
Residue:458
BDBM50205858
NameBDBM50205858
Synonyms:(R)-9-ethyl-8-methoxy-1,3,4,10b-tetrahydropyrazino[2,1-a]-isoindol-6(2H)-one | CHEMBL374436
TypeSmall organic molecule
Emp. Form.C14H18N2O2
Mol. Mass.246.3049
SMILESCCc1cc2[C@@H]3CNCCN3C(=O)c2cc1OC