Reaction Details
Target5-hydroxytryptamine receptor 2B
LigandBDBM50205899
Substrate/Competitorn/a
Meas. Tech.ChEMBL_428468 (CHEMBL918969)
EC50 22±n/a nM
Citation Wacker, DAVarnes, JGMalmstrom, SECao, XHung, CPUng, TWu, GZhang, GZuvich, EThomas, MAKeim, WJCullen, MJRohrbach, KWQu, QNarayanan, RRossi, KJanovitz, ELehman-McKeeman, LMalley, MFDevenny, JPelleymounter, MAMiller, KJRobl, JA Discovery of (R)-9-ethyl-1,3,4,10b-tetrahydro-7-trifluoromethylpyrazino[2,1-a]isoindol- 6(2H)-one, a selective, orally active agonist of the 5-HT(2C) receptor. J Med Chem50:1365-79 (2007) 
 
5-hydroxytryptamine receptor 2B
Name:5-hydroxytryptamine receptor 2B
Type:G Protein-Coupled Receptor (GPCR)
Mol. Mass.:54312.47
Organism:Homo sapiens (Human)
Description:Receptor binding assays were performed using human clone stably expressed in CHO cells.
Residue:481
BDBM50205899
NameBDBM50205899
Synonyms:(1S,10bR)-1-methyl-1,3,4,10b-tetrahydro-7-trifluoromethylpyrazino[2,1-a]isoindol-6(2H)-one | CHEMBL219837
TypeSmall organic molecule
Emp. Form.C13H13F3N2O
Mol. Mass.270.2503
SMILESC[C@@H]1NCCN2[C@@H]1c1cccc(c1C2=O)C(F)(F)F