Reaction Details
TargetFatty acid-binding protein, adipocyte
LigandBDBM50212875
Substrate/Competitorn/a
Meas. Tech.ChEMBL_455933 (CHEMBL887934)
Ki 650±n/a nM
Citation Sulsky, RMagnin, DRHuang, YSimpkins, LTaunk, PPatel, MZhu, YStouch, TRBassolino-Klimas, DParker, RHarrity, TStoffel, RTaylor, DSLavoie, TBKish, KJacobson, BLSheriff, SAdam, LPEwing, WRRobl, JA Potent and selective biphenyl azole inhibitors of adipocyte fatty acid binding protein (aFABP). Bioorg Med Chem Lett17:3511-5 (2007) 
 
Fatty acid-binding protein, adipocyte
Name:Fatty acid-binding protein, adipocyte
Type:Enzyme
Mol. Mass.:14719.23
Organism:Homo sapiens (Human)
Description:P15090
Residue:132
BDBM50212875
NameBDBM50212875
Synonyms:2'-(5-ethyl-3,4-diphenyl-pyrazol-1-yl)-biphenyl-3-carboxylic acid | CHEMBL394440
TypeSmall organic molecule
Emp. Form.C30H24N2O2
Mol. Mass.444.5238
SMILESCCc1c(c(nn1-c1ccccc1-c1cccc(c1)C(O)=O)-c1ccccc1)-c1ccccc1