Reaction Details
TargetFatty acid-binding protein, adipocyte
LigandBDBM50212886
Substrate/Competitorn/a
Meas. Tech.ChEMBL_455936 (CHEMBL887937)
Ki 32±n/a nM
Citation Sulsky, RMagnin, DRHuang, YSimpkins, LTaunk, PPatel, MZhu, YStouch, TRBassolino-Klimas, DParker, RHarrity, TStoffel, RTaylor, DSLavoie, TBKish, KJacobson, BLSheriff, SAdam, LPEwing, WRRobl, JA Potent and selective biphenyl azole inhibitors of adipocyte fatty acid binding protein (aFABP). Bioorg Med Chem Lett17:3511-5 (2007) 
 
Fatty acid-binding protein, adipocyte
Name:Fatty acid-binding protein, adipocyte
Type:Enzyme
Mol. Mass.:14719.23
Organism:Homo sapiens (Human)
Description:P15090
Residue:132
BDBM50212886
NameBDBM50212886
Synonyms:CHEMBL247529 | [2'-(3-ethyl-4,5-diphenyl-furan-2-yl)-biphenyl-3-yloxy]-acetic acid
TypeSmall organic molecule
Emp. Form.C32H26O4
Mol. Mass.474.5464
SMILESCCc1c(oc(c1-c1ccccc1)-c1ccccc1)-c1ccccc1-c1cccc(OCC(O)=O)c1