Reaction Details
TargetFatty acid-binding protein, adipocyte
LigandBDBM50212876
Substrate/Competitorn/a
Meas. Tech.ChEMBL_455933 (CHEMBL887934)
Ki 2±n/a nM
Citation Sulsky, RMagnin, DRHuang, YSimpkins, LTaunk, PPatel, MZhu, YStouch, TRBassolino-Klimas, DParker, RHarrity, TStoffel, RTaylor, DSLavoie, TBKish, KJacobson, BLSheriff, SAdam, LPEwing, WRRobl, JA Potent and selective biphenyl azole inhibitors of adipocyte fatty acid binding protein (aFABP). Bioorg Med Chem Lett17:3511-5 (2007) 
 
Fatty acid-binding protein, adipocyte
Name:Fatty acid-binding protein, adipocyte
Type:Enzyme
Mol. Mass.:14719.23
Organism:Homo sapiens (Human)
Description:P15090
Residue:132
BDBM50212876
NameBDBM50212876
Synonyms:2,3-bis[(2,4-dichlorobenzyl)oxy]benzoic acid | CHEMBL247298
TypeSmall organic molecule
Emp. Form.C21H14Cl4O4
Mol. Mass.472.145
SMILESOC(=O)c1cccc(OCc2ccc(Cl)cc2Cl)c1OCc1ccc(Cl)cc1Cl