Reaction Details
TargetFatty acid-binding protein, adipocyte
LigandBDBM50029969
Substrate/Competitorn/a
Meas. Tech.ChEMBL_455933 (CHEMBL887934)
Ki 6±n/a nM
Citation Sulsky, RMagnin, DRHuang, YSimpkins, LTaunk, PPatel, MZhu, YStouch, TRBassolino-Klimas, DParker, RHarrity, TStoffel, RTaylor, DSLavoie, TBKish, KJacobson, BLSheriff, SAdam, LPEwing, WRRobl, JA Potent and selective biphenyl azole inhibitors of adipocyte fatty acid binding protein (aFABP). Bioorg Med Chem Lett17:3511-5 (2007) 
 
Fatty acid-binding protein, adipocyte
Name:Fatty acid-binding protein, adipocyte
Type:Enzyme
Mol. Mass.:14719.23
Organism:Homo sapiens (Human)
Description:P15090
Residue:132
BDBM50029969
NameBDBM50029969
Synonyms:CHEMBL126078 | [2'-(4,5-Diphenyl-oxazol-2-yl)-biphenyl-3-yloxy]-acetic acid
TypeSmall organic molecule
Emp. Form.C29H21NO4
Mol. Mass.447.4813
SMILESOC(=O)COc1cccc(c1)-c1ccccc1-c1nc(c(o1)-c1ccccc1)-c1ccccc1