Reaction Details
TargetFatty acid-binding protein 5
LigandBDBM50212887
Substrate/Competitorn/a
Meas. Tech.ChEMBL_455935 (CHEMBL887936)
Ki>2000±n/a nM
Citation Sulsky, RMagnin, DRHuang, YSimpkins, LTaunk, PPatel, MZhu, YStouch, TRBassolino-Klimas, DParker, RHarrity, TStoffel, RTaylor, DSLavoie, TBKish, KJacobson, BLSheriff, SAdam, LPEwing, WRRobl, JA Potent and selective biphenyl azole inhibitors of adipocyte fatty acid binding protein (aFABP). Bioorg Med Chem Lett17:3511-5 (2007) 
 
Fatty acid-binding protein 5
Name:Fatty acid-binding protein 5
Type:Enzyme
Mol. Mass.:15164.79
Organism:Homo sapiens (Human)
Description:Q01469
Residue:135
BDBM50212887
NameBDBM50212887
Synonyms:CHEMBL394966 | [2'-(4,5-diphenyl-1H-pyrrol-2-yl)-biphenyl-3-yloxy]-acetic acid
TypeSmall organic molecule
Emp. Form.C30H23NO3
Mol. Mass.445.5085
SMILESOC(=O)COc1cccc(c1)-c1ccccc1-c1cc(c([nH]1)-c1ccccc1)-c1ccccc1