Reaction Details
TargetFatty acid-binding protein, heart
LigandBDBM50002838
Substrate/Competitorn/a
Meas. Tech.ChEMBL_455934 (CHEMBL887935)
Ki 32±n/a nM
Citation Sulsky, RMagnin, DRHuang, YSimpkins, LTaunk, PPatel, MZhu, YStouch, TRBassolino-Klimas, DParker, RHarrity, TStoffel, RTaylor, DSLavoie, TBKish, KJacobson, BLSheriff, SAdam, LPEwing, WRRobl, JA Potent and selective biphenyl azole inhibitors of adipocyte fatty acid binding protein (aFABP). Bioorg Med Chem Lett17:3511-5 (2007) 
 
Fatty acid-binding protein, heart
Name:Fatty acid-binding protein, heart
Type:PROTEIN
Mol. Mass.:14858.36
Organism:Homo sapiens (Human)
Description:ChEMBL_1463784
Residue:133
BDBM50002838
NameBDBM50002838
Synonyms:5-(2-(4,5-diphenyloxazol-2-yl)phenoxy)pentanoic acid 5-[2-(4,5-Diphenyl-oxazol-2-yl)-phenoxy]-pentanoic acid;hydrate | CHEMBL116533
TypeSmall organic molecule
Emp. Form.C26H23NO4
Mol. Mass.413.4651
SMILESOC(=O)CCCCOc1ccccc1-c1nc(c(o1)-c1ccccc1)-c1ccccc1