Reaction Details
TargetFatty acid-binding protein, adipocyte
LigandBDBM50212883
Substrate/Competitorn/a
Meas. Tech.ChEMBL_455936 (CHEMBL887937)
Ki 8.7±n/a nM
Citation Sulsky, RMagnin, DRHuang, YSimpkins, LTaunk, PPatel, MZhu, YStouch, TRBassolino-Klimas, DParker, RHarrity, TStoffel, RTaylor, DSLavoie, TBKish, KJacobson, BLSheriff, SAdam, LPEwing, WRRobl, JA Potent and selective biphenyl azole inhibitors of adipocyte fatty acid binding protein (aFABP). Bioorg Med Chem Lett17:3511-5 (2007) 
 
Fatty acid-binding protein, adipocyte
Name:Fatty acid-binding protein, adipocyte
Type:Enzyme
Mol. Mass.:14719.23
Organism:Homo sapiens (Human)
Description:P15090
Residue:132
BDBM50212883
NameBDBM50212883
Synonyms:CHEMBL397385 | {2'-[1-(2-fluoro-ethyl)-4,5-diphenyl-1H-imidazol-2-yl]-biphenyl-3-yloxy}-acetic acid
TypeSmall organic molecule
Emp. Form.C31H25FN2O3
Mol. Mass.492.5402
SMILESOC(=O)COc1cccc(c1)-c1ccccc1-c1nc(c(-c2ccccc2)n1CCF)-c1ccccc1