Reaction Details
TargetThymidine kinase
LigandBDBM50217802
Substrate/Competitorn/a
Meas. Tech.ChEMBL_444706 (CHEMBL894947)
IC50 3700±n/a nM
Citation Robins, MJNowak, IRajwanshi, VKMiranda, KCannon, JFPeterson, MAAndrei, GSnoeck, RDe Clercq, EBalzarini, J Synthesis and antiviral evaluation of 6-(alkyl-heteroaryl)furo[2,3-d]pyrimidin-2(3H)-one nucleosides and analogues with ethynyl, ethenyl, and ethyl spacers at C6 of the furopyrimidine core. J Med Chem50:3897-905 (2007) 
 
Thymidine kinase
Name:Thymidine kinase
Type:PROTEIN
Mol. Mass.:37819.99
Organism:Varicella-zoster virus (strain Dumas) (HHV-3) (Human herpesvirus 3)
Description:ChEMBL_444706
Residue:341
BDBM50217802
NameBDBM50217802
Synonyms:3-(2-deoxy-beta-D-erythro-pentofuranosyl)-6-(4-hexylpyrid-2-yl)furo[2,3-d]pyrimidin-2(3H)-one | CHEMBL244824
TypeSmall organic molecule
Emp. Form.C22H27N3O5
Mol. Mass.413.4669
SMILESCCCCCCc1ccc(nc1)-c1cc2cn([C@H]3C[C@H](O)[C@@H](CO)O3)c(=O)nc2o1