Reaction Details
TargetGlutamate receptor ionotropic, NMDA 2B
LigandBDBM50220597
Substrate/Competitorn/a
Meas. Tech.ChEMBL_457343 (CHEMBL940934)
Ki 15±n/a nM
Citation Kawai, MSakurada, IMorita, AIwamuro, YAndo, KOmura, HSakakibara, SMasuda, TKoike, HHonma, THattori, KTakashima, TMizuno, KMizutani, MKawamura, M Structure-activity relationship study of novel NR2B-selective antagonists with arylamides to avoid reactive metabolites formation. Bioorg Med Chem Lett17:5537-42 (2007) 
 
Glutamate receptor ionotropic, NMDA 2B
Name:Glutamate receptor ionotropic, NMDA 2B
Type:Protein
Mol. Mass.:166077.66
Organism:Rattus norvegicus (Rat)
Description:Q00960
Residue:1482
BDBM50220597
NameBDBM50220597
Synonyms:CHEMBL398356 | N-(((1s,4s)-4-(2-phenoxyethyl)cyclohexyl)methyl)-1H-indazole-5-carboxamide
TypeSmall organic molecule
Emp. Form.C23H27N3O2
Mol. Mass.377.4794
SMILESO=C(NC[C@@H]1CC[C@H](CCOc2ccccc2)CC1)c1ccc2[nH]ncc2c1