Reaction Details
TargetGlutamate receptor ionotropic, NMDA 2B
LigandBDBM50220600
Substrate/Competitorn/a
Meas. Tech.ChEMBL_457343 (CHEMBL940934)
Ki 84±n/a nM
Citation Kawai, MSakurada, IMorita, AIwamuro, YAndo, KOmura, HSakakibara, SMasuda, TKoike, HHonma, THattori, KTakashima, TMizuno, KMizutani, MKawamura, M Structure-activity relationship study of novel NR2B-selective antagonists with arylamides to avoid reactive metabolites formation. Bioorg Med Chem Lett17:5537-42 (2007) 
 
Glutamate receptor ionotropic, NMDA 2B
Name:Glutamate receptor ionotropic, NMDA 2B
Type:Protein
Mol. Mass.:166077.66
Organism:Rattus norvegicus (Rat)
Description:Q00960
Residue:1482
BDBM50220600
NameBDBM50220600
Synonyms:CHEMBL398357 | N-(((1s,4s)-4-(phenoxymethyl)cyclohexyl)methyl)-1H-pyrrole-3-carboxamide
TypeSmall organic molecule
Emp. Form.C19H24N2O2
Mol. Mass.312.4061
SMILESO=C(NC[C@H]1CC[C@@H](COc2ccccc2)CC1)c1cc[nH]c1