Reaction Details
TargetVascular endothelial growth factor receptor 2
LigandBDBM50222502
Substrate/Competitorn/a
Meas. Tech.ChEMBL_457937 (CHEMBL925259)
Ki>20000±n/a nM
Citation Dominguez, CSmith, LHuang, QYuan, COuyang, XCai, LChen, PKim, JHarvey, TSyed, RKim, TSTasker, AWang, LZhang, MCoxon, ABready, JStarnes, CChen, DGan, YNeervannan, SKumar, GPolverino, AKendall, R Discovery of N-phenyl nicotinamides as potent inhibitors of Kdr. Bioorg Med Chem Lett17:6003-8 (2007) 
 
Vascular endothelial growth factor receptor 2
Name:Vascular endothelial growth factor receptor 2
Type:Receptor Tyrosine Kinase
Mol. Mass.:151510.97
Organism:Homo sapiens (Human)
Description:P35968
Residue:1356
BDBM50222502
NameBDBM50222502
Synonyms:CHEMBL249606 | N-(2-phenoxyphenyl)-2-(pyridin-4-ylmethylamino)nicotinamide
TypeSmall organic molecule
Emp. Form.C24H20N4O2
Mol. Mass.396.4412
SMILESO=C(Nc1ccccc1Oc1ccccc1)c1cccnc1NCc1ccncc1