Reaction Details
TargetVascular endothelial growth factor receptor 2
LigandBDBM50132151
Substrate/Competitorn/a
Meas. Tech.ChEMBL_457937 (CHEMBL925259)
Ki 15±n/a nM
Citation Dominguez, CSmith, LHuang, QYuan, COuyang, XCai, LChen, PKim, JHarvey, TSyed, RKim, TSTasker, AWang, LZhang, MCoxon, ABready, JStarnes, CChen, DGan, YNeervannan, SKumar, GPolverino, AKendall, R Discovery of N-phenyl nicotinamides as potent inhibitors of Kdr. Bioorg Med Chem Lett17:6003-8 (2007) 
 
Vascular endothelial growth factor receptor 2
Name:Vascular endothelial growth factor receptor 2
Type:Receptor Tyrosine Kinase
Mol. Mass.:151510.97
Organism:Homo sapiens (Human)
Description:P35968
Residue:1356
BDBM50132151
NameBDBM50132151
Synonyms:CHEMBL101683 N-(4-chlorophenyl)-2-(pyridin-4-ylmethylamino)benzamide | N-(4-chlorophenyl)-2-[(pyridin-4-ylmethyl)amino]benzamide
TypeSmall organic molecule
Emp. Form.C19H16ClN3O
Mol. Mass.337.803
SMILESClc1ccc(NC(=O)c2ccccc2NCc2ccncc2)cc1