Reaction Details
TargetVascular endothelial growth factor receptor 2
LigandBDBM50222504
Substrate/Competitorn/a
Meas. Tech.ChEMBL_457937 (CHEMBL925259)
Ki 29±n/a nM
Citation Dominguez, CSmith, LHuang, QYuan, COuyang, XCai, LChen, PKim, JHarvey, TSyed, RKim, TSTasker, AWang, LZhang, MCoxon, ABready, JStarnes, CChen, DGan, YNeervannan, SKumar, GPolverino, AKendall, R Discovery of N-phenyl nicotinamides as potent inhibitors of Kdr. Bioorg Med Chem Lett17:6003-8 (2007) 
 
Vascular endothelial growth factor receptor 2
Name:Vascular endothelial growth factor receptor 2
Type:Receptor Tyrosine Kinase
Mol. Mass.:151510.97
Organism:Homo sapiens (Human)
Description:P35968
Residue:1356
BDBM50222504
NameBDBM50222504
Synonyms:CHEMBL249192 | ethyl 5-(3-(2-(pyridin-4-ylmethylamino)nicotinamido)phenyl)furan-3-carboxylate
TypeSmall organic molecule
Emp. Form.C25H22N4O4
Mol. Mass.442.4666
SMILESCCOC(=O)c1coc(c1)-c1cccc(NC(=O)c2cccnc2NCc2ccncc2)c1