Reaction Details
TargetVascular endothelial growth factor receptor 2
LigandBDBM50222505
Substrate/Competitorn/a
Meas. Tech.ChEMBL_457937 (CHEMBL925259)
Ki>10000±n/a nM
Citation Dominguez, CSmith, LHuang, QYuan, COuyang, XCai, LChen, PKim, JHarvey, TSyed, RKim, TSTasker, AWang, LZhang, MCoxon, ABready, JStarnes, CChen, DGan, YNeervannan, SKumar, GPolverino, AKendall, R Discovery of N-phenyl nicotinamides as potent inhibitors of Kdr. Bioorg Med Chem Lett17:6003-8 (2007) 
 
Vascular endothelial growth factor receptor 2
Name:Vascular endothelial growth factor receptor 2
Type:Receptor Tyrosine Kinase
Mol. Mass.:151510.97
Organism:Homo sapiens (Human)
Description:P35968
Residue:1356
BDBM50222505
NameBDBM50222505
Synonyms:CHEMBL250472 | N-(4-chlorophenyl)-3-(pyridin-4-ylmethylamino)picolinamide
TypeSmall organic molecule
Emp. Form.C18H15ClN4O
Mol. Mass.338.791
SMILESClc1ccc(NC(=O)c2ncccc2NCc2ccncc2)cc1