Reaction Details
TargetComplement C1s subcomponent
LigandBDBM50233693
Substrate/Competitorn/a
Meas. Tech.ChEMBL_462407 (CHEMBL927223)
Ki 120±n/a nM
Citation Travins, JMAli, FHuang, HBallentine, SKKhalil, EHufnagel, HRPan, WGushue, JLeonard, KBone, RFSoll, RMDesJarlais, RLCrysler, CSNinan, NKirkpatrick, JCummings, MDHuebert, NMolloy, CJGaul, MTomczuk, BESubasinghe, NL Biphenylsulfonyl-thiophene-carboxamidine inhibitors of the complement component C1s. Bioorg Med Chem Lett18:1603-6 (2008) 
 
Complement C1s subcomponent
Name:Complement C1s subcomponent
Type:Protein
Mol. Mass.:76657.91
Organism:Homo sapiens (Human)
Description:P09871
Residue:688
BDBM50233693
NameBDBM50233693
Synonyms:CHEMBL252619 | N-[3'-(5-carbamimidoyl-2-methylsulfanyl-thiophene-3-sulfonyl)-6-methyl-biphenyl-2-yl]-2-methanesulfonyl-acetamide
TypeSmall organic molecule
Emp. Form.C22H23N3O5S4
Mol. Mass.537.695
SMILESCSc1sc(cc1S(=O)(=O)c1cccc(c1)-c1c(C)cccc1NC(=O)CS(C)(=O)=O)C(N)=N