Reaction Details
TargetReceptor tyrosine-protein kinase erbB-2
LigandBDBM50236371
Substrate/Competitorn/a
Meas. Tech.ChEMBL_462988 (CHEMBL928909)
IC50 140±n/a nM
Citation Barlaam, BActon, DGBallard, PBradbury, RHCross, DDucray, RGermain, HHudson, KKlinowska, TMagnien, FOgilvie, DJOlivier, ARoss, HSSmith, RTrigwell, CBVautier, MWright, L Neutral 5-substituted 4-indazolylaminoquinazolines as potent, orally active inhibitors of erbB2 receptor tyrosine kinase. Bioorg Med Chem Lett18:1799-803 (2008) 
 
Receptor tyrosine-protein kinase erbB-2
Name:Receptor tyrosine-protein kinase erbB-2
Type:n/a
Mol. Mass.:137894.47
Organism:Homo sapiens (Human)
Description:P04626
Residue:1255
BDBM50236371
NameBDBM50236371
Synonyms:(S)-1-morpholino-2-(4-(1-(pyridin-2-ylmethyl)-1H-indazol-5-ylamino)quinazolin-5-yloxy)propan-1-one | CHEMBL413997
TypeSmall organic molecule
Emp. Form.C28H27N7O3
Mol. Mass.509.5591
SMILESC[C@H](Oc1cccc2ncnc(Nc3ccc4n(Cc5ccccn5)ncc4c3)c12)C(=O)N1CCOCC1